Open Document Package Metadata Manifest Ontology
type: Ontology
type: Thing
label: ODF Package Metadata Manifest

OpenDocument Document
type: Class

OpenDocument Document Package File
type: Class

contains
type: ObjectProperty
domain: OpenDocument Document
range: OpenDocument Document Package File
comment: Related to dcterms:hasPart of the Dublin Core Metadata Initiative

An OpenDocument Metadata File
type: Class
comment: Used for any metadata file in the document
subclass of: OpenDocument Document Package File

the MIME type
type: DatatypeProperty
type: FunctionalProperty
domain: OpenDocument Document Package File
range: string
comment: A string representing the MIME media type of a file (see RFC4288).

OpenDocument Package XML Element
type: Class