Translation Language
type: ObjectProperty
domain: LexicographicResource
range: TranslationLanguage

TranslationLanguage
type: Class
comment: Represents one of the languages in which translations are given in this lexicographic resource
subclass of: Restriction
  on property: Language Code
  cardinality: 1
subclass of: Restriction
  on property: listingOrder
  cardinality: 1
subclass of: HasLangCode

Language Code
type: ObjectProperty
domain: HasLangCode
range: language

Headword Explanation
type: ObjectProperty
domain: Sense
range: Headword Explanation

Headword Translation
type: ObjectProperty
domain: Sense
range: Headword Translation

Headword Translation
type: Class
comment: Represents one of possibly multiple translations of a headword
subclass of: Restriction
  on property: text
  cardinality: 1
subclass of: Restriction
  on property: language
  max cardinality: 1
subclass of: Restriction
  on property: listingOrder
  cardinality: 1

Headword Explanation
type: Class
comment: Represents a statement in the translation language which explains (but does not translate) the meaning of the headword.
subclass of: Restriction
  on property: text
  cardinality: 1
subclass of: Restriction
  on property: language
  max cardinality: 1

Example Translation
type: ObjectProperty
domain: Example
range: Example Translation

Example Translation
type: Class
comment: Represents the translation of an example.
subclass of: Restriction
  on property: text
  cardinality: 1
subclass of: Restriction
  on property: language
  max cardinality: 1