Etymology
type: ObjectProperty
domain: Entry
range: Etymology

Etymology
type: Class
comment: Represents a chain of historical derivations of a word.
subclass of: Restriction
  on property: description
  max cardinality: 1
subclass of: Restriction
  on property: listingOrder
  cardinality: 1

Etymon
type: ObjectProperty
domain: Etymology
range: Etymon

Etymon
type: Class
comment: Represents one stage (of possibly several) in the etymological history of the headword.
subclass of: Restriction
  on property: When
  max cardinality: 1
subclass of: Restriction
  on property: type
  max cardinality: 1
subclass of: Restriction
  on property: Note
  max cardinality: 1
subclass of: Restriction
  on property: Etymon Unit
  min cardinality: 1
subclass of: Restriction
  on property: listingOrder
  cardinality: 1
subclass of: HasTranslation

When
type: DatatypeProperty
domain: Etymon
range: string

Note
type: DatatypeProperty
domain: Etymon
range: string

Etymon Unit
type: ObjectProperty
domain: Etymon
range: Etymon Unit

Translation
type: DatatypeProperty
domain: HasTranslation
range: string

Etymon Unit
subclass of: HasTranslation
type: Class
comment: Represents a form (typically a word) which is the etymological origin of the headword, or another etymologically related form
subclass of: Restriction
  on property: language
  cardinality: 1
subclass of: Restriction
  on property: text
  cardinality: 1
subclass of: Restriction
  on property: Reconstructed
  max cardinality: 1
subclass of: Restriction
  on property: Translation
  max cardinality: 1
subclass of: Restriction
  on property: listingOrder
  cardinality: 1

Reconstructed
type: DatatypeProperty
domain: Etymon Unit
range: boolean

Etymon Type
type: ObjectProperty
domain: LexicographicResource
range: Etymon Type

Etymon Type
type: Class
comment: Represents one of possible values for the type of etymon.
subclass of: Restriction
  on property: type
  cardinality: 1
subclass of: Restriction
  on property: description
  max cardinality: 1
subclass of: HasSameAs

Etymon Language
type: ObjectProperty
domain: LexicographicResource
range: Etymon Language

Etymon Language
type: Class
comment: Represents one of several allowed values for the language property of etymonUnit objects.
subclass of: Restriction
  on property: langCode
  cardinality: 1
subclass of: Restriction
  on property: Display Name
  max cardinality: 1
subclass of: HasSameAs

Display Name
type: ObjectProperty
domain: Etymon Language
range: string