Placeholder Marker
type: ObjectProperty
domain: HasPlaceholderMarker
range: Placeholder Marker

Placeholder Marker
type: Class
comment: Marks up a substring inside a headword or inside a headword translation which is not part of the expression itself but stands for things that can take its place.
subclass of: Restriction
  on property: Start Index
  cardinality: 1
subclass of: Restriction
  on property: End Index
  cardinality: 1
subclass of: HasIndex

Start Index
type: DatatypeProperty
domain: HasIndex
range: string

End Index
type: DatatypeProperty
domain: HasIndex
range: string

Headword Marker
subclass of: HasIndex
type: Class
comment: Marks up a substring inside an example, inside an example translation or inside a definition which corresponds to the headword (or to a translation of the headword)
subclass of: Restriction
  on property: Start Index
  cardinality: 1
subclass of: Restriction
  on property: End Index
  cardinality: 1

Headword Marker
type: ObjectProperty
domain: HasMarker
range: Headword Marker

Collocate Marker
type: ObjectProperty
domain: HasMarker
range: Collocate Marker

Collocate Marker
type: Class
comment: Marks up a substring other than the headword inside an example, inside an example translation or inside a definition.
subclass of: Restriction
  on property: Start Index
  cardinality: 1
subclass of: Restriction
  on property: End Index
  cardinality: 1
subclass of: Restriction
  on property: Lemma
  max cardinality: 1
subclass of: HasLemma

Lemma
type: DatatypeProperty
domain: HasLemma
range: string